{"text_format":"1","workbook":"xlsx","n_sheets":15,"sheets":["Instructions","BE list","WP list","Lump sum brkdwn tpl","Lump sum breakdown","Person-months overview tpl","Person-months overview","Summary per WP tpl","Summary per WP","BE tpl","BE1","Depreciation costs","Any comments","Change Log","CountryList"],"not_rendered":{"charts":0,"images":2,"macros":1,"external_links":1,"defined_names":15,"comments":0,"pivot_tables":0},"unopened":[],"bounds":{"document_bytes":16777216,"sheet_cells":100000,"rows_first":2000,"rows_last":500,"rows_between":2000,"halvings":0,"cell_chars":16384,"cell_head_chars":4096},"cells_cut":0,"cells_raw":0,"read":"whole","date_system":"1900"}

{"sheet":"Instructions","index":0,"n_rows":19,"n_cols":5,"rows_kept":19,"cut":false,"hidden":false,"merged":[[11,1,11,3],[5,0,5,3],[8,0,9,0],[8,1,8,3],[9,1,9,3],[10,1,10,3],[12,0,13,0],[18,1,18,3],[14,1,14,3],[15,1,15,3],[16,1,16,3],[17,1,17,3],[12,1,12,3],[13,1,13,3]]}
[]
[null,"Horizon Europe Programme"]
[]
[null,"Detailed lump sum budget",null,"Generate the Excel file in macro-free format \nReady for the online submission system"]
[]
["Instructions"]
[null,"Go to Beneficiaries and Affiliated Entities list","! Double click buttons !","Go to Work packages list"]
[]
["GENERAL INSTRUCTIONS","This workbook enables you to present the detailed estimation of costs of your lump sum project (grant component) and to calculate the lump sum breakdown for the beneficiary and per work package. It must be uploaded as  “Lump sum\" annex at the ‘Proposal forms’ step of proposal submission. This is mandatory. If you do not upload the Excel workbook, the proposal submission will be blocked.\n\nYou must not change the structure of this workbook (e.g., do not add, remove or modify rows, columns or tabs).\n\nComprehensive guidance and background on lump sum funding under Horizon Europe is available on the Funding & Tenders Portal. To get started, we recommend to read the guide Lump sum funding – what do I need to know. This includes details on how to complete this Excel workbook. The weblinks are provided in column E.\n\nWe recommend using Excel 2013 (Windows) / Excel 2016 (Mac OS) or more recent.",null,null,"Lump sum funding under Horizon Europe\n"]
[null,"The only currency used in this workbook is EURO.\n\nYou must complete the following sheets: ‘BE list’ – ‘WP list’ – ‘BE1’ – ‘Depreciation costs’ (if any).\n\nThe information in this workbook must correspond to the main proposal. For example, the beneficiary and affiliated entities (if any) and the list of work packages must be the same. Likewise, the tables in section 3.1 of Part B of the proposal must be in line with the budget presented here (e.g., table 3.1h ‘purchase costs’, and table 3.1i ‘internally invoiced goods and services’).",null,null,"Lump sum funding - what do I need to know"]
["BE LIST","In the ‘BE list’, complete the details of the beneficiary and add affiliated entities (if applicable). They must be the same as in the main proposal and listed in the same order.  To add an affiliated entity, click on the “Add AE” button next to the beneficiary. \n\nThe detailed lump sum budget table covers exclusively those participants that receive EU funding. Associated partners do not complete it.\n\nFor the beneficiary and each affiliated entity, you must select the country . The funding rate is used in the automatic calculation of the lump sum breakdown. For EIC Accelerator calls, the funding rate is always 70%. \n\nOnce you have completed the ‘BE list’ sheet, click the “Apply changes” button. This updates the ‘BE1’ sheet for the beneficiary. Affiliated entities have no separate sheets, they are included in the beneficiary sheet. \n\nTo delete an affiliated entity, click the “Clear AE” button next to it. The beneficiary BE1 cannot be deleted, but its details can be modified. "]
["WP LIST","In the ‘WP list’, add the work packages. They must correspond to the list of work packages in the main proposal (Table 3.1a) and be presented in the same order. To add work packages, click the \"Add WP\" button. Once you have completed the ‘WP list’ sheet, click the “Apply changes” button.\n\nTo delete a work package, click the “Clear WP” button next to it and then “Apply changes”. The first work package WP1 cannot be deleted, but its details can be modified. There is no back-up for deleted work packages."]
["BE1","You must complete the ‘BE1’ sheet for the beneficiary. This sheet includes one section for each work package. Each work package section contains the full list of cost categories. Complete the information for each work package in which the beneficiary participates. \n\nIf there is an affiliated entity to the beneficiary, the sheet will include a second table for the cost estimations of the affiliated entity. Complete the information for each work package in which the affiliated entity participates. \n\nFor the cost categories used, you must enter the number of items and the cost per item in Euro (yellow cells). The total cost per cost category is calculated automatically. If a cost category is not used leave cells blank.\n \nPreferably use whole numbers for the costs per item (no Euro cents). The number of items can be a fraction (e.g., 0.5 items).\n\nLump sum proposals may contain only costs that are eligible under Horizon Europe (same eligibility rules as for actual cost grants).\n\nEnter your personnel costs in section “A. DIRECT PERSONNEL COSTS”. For personnel costs, the number of items is the number of person-months (e.g., 10 items correspond to 10 person-months).\n\nA senior scientist corresponds to career stages A and B in the Researcher Table in Part A of the proposal, or to an equivalent position in the private sector. A junior scientist corresponds to career stage C and D in the Researcher Table in Part A of the proposal, or to an equivalent position in the private sector.\n\nA staff category can contain more than one employee (e.g., two junior scientists in the same organisation and working on the same work package). In this case, the cost per item is the average monthly personnel cost of all employees concerned, and the number of items is the combined number of person-months. No more detailed information is required in this sheet.\n\nApplicants should justify high personnel costs in the ‘Any comments’ tab (e.g., high staff effort, need for senior staff, or high monthly rates).\n\nIn section “A.4 SME Owner and natural person beneficiaries”, the cost per item is prefilled in the workbook. When using this category, only enter the number of items."]
[null,"Enter your subcontracting costs in section “B. DIRECT SUBCONTRACTING COSTS”. \n\nThe beneficiary can have more than one subcontract associated to a work package. In this case, the cost per item is the average cost of all subcontracts, and the number of items is the number of subcontracts.\n\nIn section “C. DIRECT PURCHASE COSTS”, complete the categories “C.1 Travel and subsistence”, “C.2 Equipment”, and “C.3 Other goods, works and services”, if applicable.\n\nA category can contain more than one item (e.g., several travels, or two pieces of equipment). In this case, the cost per item is the average cost of all items. No more detailed information is required in this sheet.\n\nFor category “C.2 Equipment” (equipment, infrastructure, other assets), use the sheet ‘Depreciation costs’ as a tool to calculate the depreciation costs to be charged for the whole duration of the project (see below).\n\nCertain topics specify that the purchase of equipment, infrastructure and other assets may be declared as full capitalised costs. If this is the case for the topic you are applying to, enter the full capitalised costs in section “C.2 Equipment” (i.e., the full equipment costs). Likewise, if you have costs for renting or leasing equipment, enter them in section “C.2 Equipment”. There is no need to fill in the ‘Depreciation costs’ sheet in these cases, but you should leave a comment in the ‘Any comments’ sheet to clarify that full equipment costs or rental costs were included in the budget.\n\nIn section “D. OTHER DIRECT COSTS”, complete section “D.2 Internally invoiced goods and services”, if applicable.\n\nAll other cost categories in section D. can be used only if they are explicitly allowed in the specific conditions of the topic.\n-\t“D.1 Financial support to third parties”\n-\t“D.3 Transnational access to research infrastructure unit costs”\n-\t“D.4 Virtual access to research infrastructure unit costs”\n-\t“D.5 PCP/PPI procurement costs\"\n\nIn section “E. INDIRECT COSTS”, the indirect costs will be calculated automatically."]
["DEPRECIATION COSTS","To calculate the depreciation costs, you need to:\n- Enter the price of the equipment in the column “Purchase costs”\n- Enter the percentage of usage of the equipment for the project in the column “% used for the project”\n- Complete the column “% of useful life of the equipment in the project”. To obtain the correct value, divide the period (in months) during which the equipment is used for the project by the depreciation period (in months) for the equipment. Multiply the result by 100%.\n\nThe resulting amount is NOT automatically transferred to the ‘BE1’ sheet. You must add it manually in category “C.2 Equipment” under the appropriate work package in the ‘BE1’ sheet . If you have several items in the ‘Depreciation costs’ sheet to be encoded in one row (same work package and same resource type), you must enter the average cost and the number of items. \n\nMore information on calculating depreciation costs is available in the Annotated Model Grant Agreement. The rules on actual depreciation costs apply equally to lump sum grants except that the calculation is based on estimations and the result is included in the lump sum budget at proposal stage.",null,null,"Annotated Model Grant Agreement"]
{"$rows_left_out":5}
{"sheet":"BE list","index":1,"n_rows":4,"n_cols":8,"rows_kept":4,"cut":false,"hidden":false,"merged":[[1,0,1,5]]}
[]
["List of beneficiaries (BE) and affiliated entities (AE)",null,null,null,null,null,null,"Apply changes"]
["BE/AE nr","Role","BE/AE name","Acronym","Country","Funding rate"]
["BE1","Coordinator","Name",null,null,0.7,null,"Add AE to BE1"]

{"sheet":"WP list","index":2,"n_rows":4,"n_cols":6,"rows_kept":4,"cut":false,"hidden":false,"merged":[[1,0,1,1]]}
[]
["List of Work Packages",null,null,"Add WP","! Double click buttons !","Apply changes"]
["WP number","WP name"]
["WP1","WP1 name"]

{"sheet":"Lump sum brkdwn tpl","index":3,"n_rows":5,"n_cols":4,"rows_kept":5,"cut":false,"hidden":true,"merged":[[0,0,0,3]]}
["ESTIMATED BREAKDOWN OF THE LUMP SUM"]
["BENEFICIARIES \\ WORK PACKAGES","WPx name","Total","Pct %"]
["BEx: BEx name",null,null,{"$f":"IF(C$4>0,C3/C$4,\" \")","v":" "}]
["Total: ",null,null,{"$f":"IF(C$4>0,C4/C$4,\" \")","v":" "}]
["Percentage: ",{"$f":"IF($C4>0,B4/$C4,\" \")","v":" "},{"$f":"IF($C4>0,C4/$C4,\" \")","v":" "}]

{"sheet":"Lump sum breakdown","index":4,"n_rows":5,"n_cols":4,"rows_kept":5,"cut":false,"hidden":false,"merged":[[0,0,0,3]]}
["ESTIMATED BREAKDOWN OF THE LUMP SUM"]
["BENEFICIARIES \\ WORK PACKAGES","WP1\r\nWP1 name","Total","Pct %"]
["BE1: Test 1",{"$f":"'BE1'!D43*'BE list'!F4","v":0},{"$f":"SUM(B3)","v":0},{"$f":"IF(C$4>0,C3/C$4,\" \")","v":" "}]
["Total: ",{"$f":"SUM(B3)","v":0},{"$f":"SUM(B3)","v":0},{"$f":"IF(C$4>0,C4/C$4,\" \")","v":" "}]
["Percentage: ",{"$f":"IF($C4>0,B4/$C4,\" \")","v":" "},{"$f":"IF($C4>0,C4/$C4,\" \")","v":" "}]

{"sheet":"Person-months overview tpl","index":5,"n_rows":5,"n_cols":4,"rows_kept":5,"cut":false,"hidden":true,"merged":[[0,0,0,3]]}
["TOTAL PERSON-MONTHS"]
["BENEFICIARIES \\ WORK PACKAGES","WP1","Total","Pct %"]
["BEx: BEx name",null,{"$f":"SUM(B3:B3)","v":0},{"$f":"IF(C$4>0,C3/C$4,\" \")","v":" "}]
["Total: ",null,{"$f":"SUM(C3:C3)","v":0},{"$f":"IF(C$4>0,C4/C$4,\" \")","v":" "}]
["Percentage: ",{"$f":"IF($C4>0,B4/$C4,\" \")","v":" "},{"$f":"IF($C4>0,C4/$C4,\" \")","v":" "}]

{"sheet":"Person-months overview","index":6,"n_rows":5,"n_cols":4,"rows_kept":5,"cut":false,"hidden":false,"merged":[[0,0,0,3]]}
["TOTAL PERSON-MONTHS"]
["BENEFICIARIES \\ WORK PACKAGES","WP1\r\nWP1 name","Total","Pct %"]
["BE1: Test 1",{"$f":"SUM('BE1'!B9:B16)","v":0},{"$f":"SUM(B3)","v":0},{"$f":"IF(C$4>0,C3/C$4,\" \")","v":" "}]
["Total: ",{"$f":"SUM(B3)","v":0},{"$f":"SUM(B3)","v":0},{"$f":"IF(C$4>0,C4/C$4,\" \")","v":" "}]
["Percentage: ",{"$f":"IF($C4>0,B4/$C4,\" \")","v":" "},{"$f":"IF($C4>0,C4/$C4,\" \")","v":" "}]

{"sheet":"Summary per WP tpl","index":7,"n_rows":84,"n_cols":14,"rows_kept":84,"cut":false,"hidden":true,"merged":[[0,0,0,13],[1,1,1,3],[1,4,1,6],[4,0,4,13],[45,0,45,13],[1,9,1,10]]}
["SUM OF ALL BENEFICIARIES (including AFFILIATED ENTITIES) FOR ALL THE WORK PACKAGES"]
[null,"ALL BENEFICIARIES \n(without affiliated entities)",null,null,"ALL AFFILIATED ENTITIES",null,null,null,null,"ALL BENEFICIARIES \n(with affiliated entities)"]
[" COST CATEGORY","ITEMS","COST PER ITEM","BE TOTAL COSTS","ITEMS","COST PER ITEM","AE TOTAL COSTS",null,null,"ITEMS\n(TOTAL)","AVERAGE COST PER ITEM","BE+TP TOTAL COSTS",null,"TOTAL COSTS"]
[]
[]
[]
["A. DIRECT PERSONNEL COSTS"]
["A.1 Employees (or equivalent)"]
["SENIOR SCIENTISTS (or equivalent in the private sector)",{"$f":"#REF!+#REF!+#REF!+#REF!+#REF!+#REF!+#REF!+#REF!+#REF!+#REF!","v":{"$error":"#REF!"}},null,{"$f":"#REF!+#REF!+#REF!+#REF!+#REF!+#REF!+#REF!+#REF!+#REF!+#REF!","v":{"$error":"#REF!"}},{"$f":"#REF!+#REF!+#REF!+#REF!+#REF!+#REF!+#REF!+#REF!+#REF!+#REF!","v":{"$error":"#REF!"}},null,{"$f":"#REF!+#REF!+#REF!+#REF!+#REF!+#REF!+#REF!+#REF!+#REF!+#REF!","v":{"$error":"#REF!"}},null,{"$f":"D9+G9","v":{"$error":"#REF!"}},{"$f":"E9+B9","v":{"$error":"#REF!"}},{"$f":"IF(J9>0,L9/J9,\" \")","v":{"$error":"#REF!"}},{"$f":"G9+D9","v":{"$error":"#REF!"}},null,{"$f":"D9+G9","v":{"$error":"#REF!"}}]
["JUNIOR SCIENTISTS (or equivalent in the private sector)",{"$f":"#REF!+#REF!+#REF!+#REF!+#REF!+#REF!+#REF!+#REF!+#REF!+#REF!","v":{"$error":"#REF!"}},null,{"$f":"#REF!+#REF!+#REF!+#REF!+#REF!+#REF!+#REF!+#REF!+#REF!+#REF!","v":{"$error":"#REF!"}},{"$f":"#REF!+#REF!+#REF!+#REF!+#REF!+#REF!+#REF!+#REF!+#REF!+#REF!","v":{"$error":"#REF!"}},null,{"$f":"#REF!+#REF!+#REF!+#REF!+#REF!+#REF!+#REF!+#REF!+#REF!+#REF!","v":{"$error":"#REF!"}},null,{"$error":"#REF!"},{"$error":"#REF!"},{"$error":"#REF!"},{"$error":"#REF!"},null,{"$error":"#REF!"}]
["TECHNICAL PERSONNEL (or equivalent in the private sector)",{"$f":"#REF!+#REF!+#REF!+#REF!+#REF!+#REF!+#REF!+#REF!+#REF!+#REF!","v":{"$error":"#REF!"}},null,{"$f":"#REF!+#REF!+#REF!+#REF!+#REF!+#REF!+#REF!+#REF!+#REF!+#REF!","v":{"$error":"#REF!"}},{"$f":"#REF!+#REF!+#REF!+#REF!+#REF!+#REF!+#REF!+#REF!+#REF!+#REF!","v":{"$error":"#REF!"}},null,{"$f":"#REF!+#REF!+#REF!+#REF!+#REF!+#REF!+#REF!+#REF!+#REF!+#REF!","v":{"$error":"#REF!"}},null,{"$error":"#REF!"},{"$error":"#REF!"},{"$error":"#REF!"},{"$error":"#REF!"},null,{"$error":"#REF!"}]
["ADMINISTRATIVE PERSONNEL (or equivalent in the private sector)",{"$f":"#REF!+#REF!+#REF!+#REF!+#REF!+#REF!+#REF!+#REF!+#REF!+#REF!","v":{"$error":"#REF!"}},null,{"$f":"#REF!+#REF!+#REF!+#REF!+#REF!+#REF!+#REF!+#REF!+#REF!+#REF!","v":{"$error":"#REF!"}},{"$f":"#REF!+#REF!+#REF!+#REF!+#REF!+#REF!+#REF!+#REF!+#REF!+#REF!","v":{"$error":"#REF!"}},null,{"$f":"#REF!+#REF!+#REF!+#REF!+#REF!+#REF!+#REF!+#REF!+#REF!+#REF!","v":{"$error":"#REF!"}},null,{"$error":"#REF!"},{"$error":"#REF!"},{"$error":"#REF!"},{"$error":"#REF!"},null,{"$error":"#REF!"}]
["OTHERS",{"$f":"#REF!+#REF!+#REF!+#REF!+#REF!+#REF!+#REF!+#REF!+#REF!+#REF!","v":{"$error":"#REF!"}},null,{"$f":"#REF!+#REF!+#REF!+#REF!+#REF!+#REF!+#REF!+#REF!+#REF!+#REF!","v":{"$error":"#REF!"}},{"$f":"#REF!+#REF!+#REF!+#REF!+#REF!+#REF!+#REF!+#REF!+#REF!+#REF!","v":{"$error":"#REF!"}},null,{"$f":"#REF!+#REF!+#REF!+#REF!+#REF!+#REF!+#REF!+#REF!+#REF!+#REF!","v":{"$error":"#REF!"}},null,{"$error":"#REF!"},{"$error":"#REF!"},{"$error":"#REF!"},{"$error":"#REF!"},null,{"$error":"#REF!"}]
["A.2 Natural Persons under direct contract",{"$f":"#REF!+#REF!+#REF!+#REF!+#REF!+#REF!+#REF!+#REF!+#REF!+#REF!","v":{"$error":"#REF!"}},null,{"$f":"#REF!+#REF!+#REF!+#REF!+#REF!+#REF!+#REF!+#REF!+#REF!+#REF!","v":{"$error":"#REF!"}},{"$f":"#REF!+#REF!+#REF!+#REF!+#REF!+#REF!+#REF!+#REF!+#REF!+#REF!","v":{"$error":"#REF!"}},null,{"$f":"#REF!+#REF!+#REF!+#REF!+#REF!+#REF!+#REF!+#REF!+#REF!+#REF!","v":{"$error":"#REF!"}},null,{"$error":"#REF!"},{"$error":"#REF!"},{"$error":"#REF!"},{"$error":"#REF!"},null,{"$error":"#REF!"}]
["A.3 Seconded Persons",{"$f":"#REF!+#REF!+#REF!+#REF!+#REF!+#REF!+#REF!+#REF!+#REF!+#REF!","v":{"$error":"#REF!"}},null,{"$f":"#REF!+#REF!+#REF!+#REF!+#REF!+#REF!+#REF!+#REF!+#REF!+#REF!","v":{"$error":"#REF!"}},{"$f":"#REF!+#REF!+#REF!+#REF!+#REF!+#REF!+#REF!+#REF!+#REF!+#REF!","v":{"$error":"#REF!"}},null,{"$f":"#REF!+#REF!+#REF!+#REF!+#REF!+#REF!+#REF!+#REF!+#REF!+#REF!","v":{"$error":"#REF!"}},null,{"$error":"#REF!"},{"$error":"#REF!"},{"$error":"#REF!"},{"$error":"#REF!"},null,{"$error":"#REF!"}]
{"$rows_left_out":70}
{"sheet":"Summary per WP","index":8,"n_rows":84,"n_cols":14,"rows_kept":84,"cut":false,"hidden":false,"merged":[[45,0,45,13],[0,0,0,13],[1,1,1,3],[1,4,1,6],[1,9,1,10],[4,0,4,13]]}
["SUM OF ALL BENEFICIARIES (including AFFILIATED ENTITIES) FOR ALL THE WORK PACKAGES"]
[null,"ALL BENEFICIARIES \n(without affiliated entities)",null,null,"ALL AFFILIATED ENTITIES",null,null,null,null,"ALL BENEFICIARIES \n(with affiliated entities)"]
[" COST CATEGORY","ITEMS","COST PER ITEM","BE TOTAL COSTS","ITEMS","COST PER ITEM","AE TOTAL COSTS",null,null,"ITEMS\n(TOTAL)","AVERAGE COST PER ITEM","BE+TP TOTAL COSTS",null,"TOTAL COSTS"]
[]
["COSTS WORK PACKAGE 1: WP1 name"]
[]
["A. DIRECT PERSONNEL COSTS"]
["A.1 Employees (or equivalent)"]
["SENIOR SCIENTISTS (or equivalent in the private sector)",{"$f":"'BE1'!B9","v":0},null,{"$f":"'BE1'!D9","v":0},null,null,null,null,{"$f":"D9+G9","v":0},{"$f":"E9+B9","v":0},{"$f":"IF(J9>0,L9/J9,\" \")","v":" "},{"$f":"G9+D9","v":0},null,{"$f":"D9+G9","v":0}]
["JUNIOR SCIENTISTS (or equivalent in the private sector)",{"$f":"'BE1'!B10","v":0},null,{"$f":"'BE1'!D10","v":0},null,null,null,null,0,0," ",0,null,0]
["TECHNICAL PERSONNEL (or equivalent in the private sector)",{"$f":"'BE1'!B11","v":0},null,{"$f":"'BE1'!D11","v":0},null,null,null,null,0,0," ",0,null,0]
["ADMINISTRATIVE PERSONNEL (or equivalent in the private sector)",{"$f":"'BE1'!B12","v":0},null,{"$f":"'BE1'!D12","v":0},null,null,null,null,0,0," ",0,null,0]
["OTHERS",{"$f":"'BE1'!B13","v":0},null,{"$f":"'BE1'!D13","v":0},null,null,null,null,0,0," ",0,null,0]
["A.2 Natural Persons under direct contract",{"$f":"'BE1'!B14","v":0},null,{"$f":"'BE1'!D14","v":0},null,null,null,null,0,0," ",0,null,0]
["A.3 Seconded Persons",{"$f":"'BE1'!B15","v":0},null,{"$f":"'BE1'!D15","v":0},null,null,null,null,0,0," ",0,null,0]
{"$rows_left_out":70}
{"sheet":"BE tpl","index":9,"n_rows":84,"n_cols":9,"rows_kept":84,"cut":false,"hidden":true,"merged":[[1,1,1,3],[1,4,1,6],[4,0,4,8],[45,0,45,8],[0,4,0,6]]}
["BENEFICIARY x - CALCULATION SHEET",null,"View Summary",null,"Affiliated Entity n"]
[]
["COST CATEGORY","ITEMS","COST PER ITEM","BE TOTAL COSTS","ITEMS","COST PER ITEM","AE TOTAL COSTS",null,"BE+AE TOTAL COSTS"]
[]
["WORK PACKAGE"]
[]
["A. DIRECT PERSONNEL COSTS"]
["A.1 Employees (or equivalent)"]
["SENIOR SCIENTISTS (or equivalent in the private sector)",null,null,{"$f":"B9*C9","v":0},null,null,{"$f":"E9*F9","v":0},null,{"$f":"D9+G9","v":0}]
["JUNIOR SCIENTISTS (or equivalent in the private sector)",null,null,{"$f":"B10*C10","v":0},null,null,{"$f":"E10*F10","v":0},null,{"$f":"D10+G10","v":0}]
["TECHNICAL PERSONNEL (or equivalent in the private sector)",null,null,0,null,null,0,null,0]
["ADMINISTRATIVE PERSONNEL (or equivalent in the private sector)",null,null,0,null,null,0,null,0]
["OTHERS",null,null,0,null,null,0,null,0]
["A.2 Natural Persons under direct contract",null,null,0,null,null,0,null,0]
["A.3 Seconded Persons",null,null,0,null,null,0,null,0]
{"$rows_left_out":70}
{"sheet":"BE1","index":10,"n_rows":84,"n_cols":4,"rows_kept":84,"cut":false,"hidden":false,"merged":[[45,0,45,3],[1,1,1,3],[4,0,4,3]]}
["Coordinator: BE1 - BUDGET SHEET",null,"View Summary"]
[null,"Test 1"]
["COST CATEGORY","ITEMS","COST PER ITEM","BE TOTAL COSTS"]
[]
[{"$f":"CONCATENATE(\"COSTS WORK PACKAGE 1:\",\" \",\"WP1 name\")","v":"COSTS WORK PACKAGE 1: WP1 name"}]
[]
["A. DIRECT PERSONNEL COSTS"]
["A.1 Employees (or equivalent)"]
["SENIOR SCIENTISTS (or equivalent in the private sector)",null,null,{"$f":"B9*C9","v":0}]
["JUNIOR SCIENTISTS (or equivalent in the private sector)",null,null,{"$f":"B10*C10","v":0}]
["TECHNICAL PERSONNEL (or equivalent in the private sector)",null,null,0]
["ADMINISTRATIVE PERSONNEL (or equivalent in the private sector)",null,null,0]
["OTHERS",null,null,0]
["A.2 Natural Persons under direct contract",null,null,0]
["A.3 Seconded Persons",null,null,0]
{"$rows_left_out":70}
{"sheet":"Depreciation costs","index":11,"n_rows":209,"n_cols":12,"rows_kept":209,"cut":false,"hidden":false,"merged":[[0,0,0,11]]}
["TOOL:   DEPRECIATION COSTS LIST"]
["BE nr","Beneficiary name","WP nr","Work Package name","Resource type","Short name of the investments","Date of purchase (real or planned date of purchase)","Purchase cost","% used for the project","% of useful life of the equipment in the project","Charged \ndepreciation costs \nper investment","Justification: Needed info for depreciation"]
[null,{"$f":"IF($A3=\"\",\"\",VLOOKUP($A3,'BE list'!A:C,3))","v":""},null,{"$f":"IF($C3=\"\",\"\",VLOOKUP($C3,'WP list'!A:B,2))","v":""},null,null,null,null,null,null,{"$f":"+H3*I3*J3","v":0}]
[null,{"$f":"IF($A4=\"\",\"\",VLOOKUP($A4,'BE list'!A:C,3))","v":""},null,{"$f":"IF($C4=\"\",\"\",VLOOKUP($C4,'WP list'!A:B,2))","v":""},null,null,null,null,null,null,0]
[null,{"$f":"IF($A5=\"\",\"\",VLOOKUP($A5,'BE list'!A:C,3))","v":""},null,{"$f":"IF($C5=\"\",\"\",VLOOKUP($C5,'WP list'!A:B,2))","v":""},null,null,null,null,null,null,0]
[null,{"$f":"IF($A6=\"\",\"\",VLOOKUP($A6,'BE list'!A:C,3))","v":""},null,{"$f":"IF($C6=\"\",\"\",VLOOKUP($C6,'WP list'!A:B,2))","v":""},null,null,null,null,null,null,0]
[null,{"$f":"IF($A7=\"\",\"\",VLOOKUP($A7,'BE list'!A:C,3))","v":""},null,{"$f":"IF($C7=\"\",\"\",VLOOKUP($C7,'WP list'!A:B,2))","v":""},null,null,null,null,null,null,0]
[null,{"$f":"IF($A8=\"\",\"\",VLOOKUP($A8,'BE list'!A:C,3))","v":""},null,{"$f":"IF($C8=\"\",\"\",VLOOKUP($C8,'WP list'!A:B,2))","v":""},null,null,null,null,null,null,0]
[null,{"$f":"IF($A9=\"\",\"\",VLOOKUP($A9,'BE list'!A:C,3))","v":""},null,{"$f":"IF($C9=\"\",\"\",VLOOKUP($C9,'WP list'!A:B,2))","v":""},null,null,null,null,null,null,0]
[null,{"$f":"IF($A10=\"\",\"\",VLOOKUP($A10,'BE list'!A:C,3))","v":""},null,{"$f":"IF($C10=\"\",\"\",VLOOKUP($C10,'WP list'!A:B,2))","v":""},null,null,null,null,null,null,0]
[null,{"$f":"IF($A11=\"\",\"\",VLOOKUP($A11,'BE list'!A:C,3))","v":""},null,{"$f":"IF($C11=\"\",\"\",VLOOKUP($C11,'WP list'!A:B,2))","v":""},null,null,null,null,null,null,0]
[null,{"$f":"IF($A12=\"\",\"\",VLOOKUP($A12,'BE list'!A:C,3))","v":""},null,{"$f":"IF($C12=\"\",\"\",VLOOKUP($C12,'WP list'!A:B,2))","v":""},null,null,null,null,null,null,0]
[null,{"$f":"IF($A13=\"\",\"\",VLOOKUP($A13,'BE list'!A:C,3))","v":""},null,{"$f":"IF($C13=\"\",\"\",VLOOKUP($C13,'WP list'!A:B,2))","v":""},null,null,null,null,null,null,0]
[null,{"$f":"IF($A14=\"\",\"\",VLOOKUP($A14,'BE list'!A:C,3))","v":""},null,{"$f":"IF($C14=\"\",\"\",VLOOKUP($C14,'WP list'!A:B,2))","v":""},null,null,null,null,null,null,0]
[null,{"$f":"IF($A15=\"\",\"\",VLOOKUP($A15,'BE list'!A:C,3))","v":""},null,{"$f":"IF($C15=\"\",\"\",VLOOKUP($C15,'WP list'!A:B,2))","v":""},null,null,null,null,null,null,0]
{"$rows_left_out":195}
{"sheet":"Any comments","index":12,"n_rows":2,"n_cols":4,"rows_kept":2,"cut":false,"hidden":false,"merged":[[0,0,0,3]]}
["Any comments"]
["nr","BE ref","WP ref","Comments"]

{"sheet":"Change Log","index":13,"n_rows":7,"n_cols":3,"rows_kept":7,"cut":false,"hidden":false,"merged":[[0,0,0,2]]}
["Change log"]
["Version","Publication date","Changes - Comments"]
["1.0","2021-05-25","- Initial version"]
["2.0","2022-04-28","- Improved layout and user-friendliness"]
["2.1","2022-12-09","- Updated Instructions.\n- Separate version available for topics with 60% and 100% funding rates."]
["3.0","2023-09-26","- Participant numbering aligned with numbering in Part A.\n- BE List with country names and country codes.\n- The terms ‘units’ and ‘cost per unit’ were replaced by ‘items’ and ‘cost per item’ (to avoid confusion with unit costs).\n- Number of items can be entered with one decimal place only.\n- Updated instructions (e.g., difference between maximum grant amount and requested EU contribution, handling of own resources, associated partners, discrepancies between the Excel budget table and Part A).\n- Added tab: Change Log."]
["EIC 1.0","2023-12-08","- Only 1 beneficiary.\n- Only Funding Rate 70%"]

{"sheet":"CountryList","index":14,"n_rows":178,"n_cols":2,"rows_kept":178,"cut":false,"hidden":true,"merged":[]}
["Country","Coefficient"]
["Austria (AT)",1.0629999999999999]
["Belgium (BE)",1]
["Bulgaria (BG)",0.54800000000000004]
["Croatia (HR)",0.755]
["Cyprus (CY) ",0.77500000000000002]
["Czechia (CZ)",0.79100000000000004]
["Denmark (DK)",1.32]
["Estonia (EE)",0.80300000000000005]
["Finland (FI)",1.1950000000000001]
["France (FR)",1.1639999999999999]
["Germany (DE)",0.98299999999999998]
["Greece (EL)",0.81599999999999995]
["Hungary (HU)",0.72]
["Ireland (IE)",1.1950000000000001]
{"$rows_left_out":163}